Added new subscription for the new CA offer

2 jobs for och in 31 minutes and 14 seconds (queued for 4 seconds)
latest
Status Job ID Name Coverage
  Test
passed #3135
black

00:02:15

failed #3134
test

00:31:14

 
Name Stage Failure
failed
test Test There is an unknown failure, please try again
Traceback (most recent call last):
File "/builds/ae/Sith/accounting/tests.py", line 231, in test_new_operation_not_authorized
self.assertTrue(response.status_code == 403)
AssertionError: False is not true

----------------------------------------------------------------------
Ran 146 tests in 1492.405s

FAILED (failures=4)
Destroying test database for alias 'default'...