Added new subscription for the new CA offer

2 jobs for och in 34 minutes and 10 seconds (queued for 6 seconds)
Status Job ID Name Coverage
  Test
failed #3133
black

00:04:56

failed #3132
test

00:34:10

 
Name Stage Failure
failed
test Test There is an unknown failure, please try again
Traceback (most recent call last):
File "/builds/ae/Sith/accounting/tests.py", line 231, in test_new_operation_not_authorized
self.assertTrue(response.status_code == 403)
AssertionError: False is not true

----------------------------------------------------------------------
Ran 146 tests in 1501.478s

FAILED (failures=4)
Destroying test database for alias 'default'...
failed
black Test There is an unknown failure, please try again
  Building wheel for black (PEP 517): finished with status 'done'
Created wheel for black: filename=black-20.8b1-py3-none-any.whl size=124185 sha256=ea7a05fb3d9c411276c21d610e52324da85819c722727df5ec24681704e232fa
Stored in directory: /root/.cache/pip/wheels/dd/c8/94/e774504958e4667180d81202d1d45cdc35d6222ae39229871b
Successfully built black
Installing collected packages: typing-extensions, typed-ast, toml, regex, pathspec, mypy-extensions, dataclasses, click, appdirs, black
Successfully installed appdirs-1.4.4 black-20.8b1 click-7.1.2 dataclasses-0.8 mypy-extensions-0.4.3 pathspec-0.8.1 regex-2020.11.13 toml-0.10.2 typed-ast-1.4.1 typing-extensions-3.7.4.3
$ black --check .
would reformat /builds/ae/Sith/subscription/migrations/0014_auto_20201207_2323.py
Oh no! 💥 💔 💥
1 file would be reformatted, 278 files would be left unchanged.